Home > Could Not > Could Not Configure A Cxx Compiler Mac

Could Not Configure A Cxx Compiler Mac

I have been struggling with this for months. mstre123 commented Jun 2, 2012 Worked. Word for fake religious people Sever-sort an array Output the sign Getting error message when integrating a simple piecewise function Does a byte contain 8 bits, or 9? more stack exchange communities company blog Stack Exchange Inbox Reputation and Badges sign up log in tour help Tour Start here for a quick overview of the site Help Center Detailed have a peek at this web-site

What are these boxes mounted inline on each of the 3 phase wires of a high voltage power line in Miami? Make sure a Cxx compiler and OpenSSL development packages are installed, else you will be stopped by these errors.wscript:261: error: could not configure a cxx compiler!wscript:372: error: Could not autodetect OpenSSL AppStoreからXcodeをインストールします。3GB弱あるのでダウンロードに時間がかかります。 2. This is exactly what I needed.

I somehow managed to make it work. Explain it to me like I'm a physics grad: Greenhouse Effect How to replace not found reference "??" in an another constant e.g "REF"? Happy times all around.

I was trying to build node v0.4.7. Note: At the time of this writing v0.2.0 is the current NodeJS version.

wget http://nodejs.org/dist/node-v0.4.12.tar.gz tar xvf node-v0.4.12.tar.gz cd node-v0.4.12/ ./configure make make install If all goes well, then you should Maybe there's another error we can't see right now. codesplicer commented Jul 25, 2011 Just tried to compile node and the same issue appears.

Al share|improve this answer answered Aug 26 '11 at 18:18 alchuck 111 add a comment| up vote 1 down vote After installing XCode 4.3.2 (in Mac OS X Lion) I still Phillips May 29 '11 at 17:38 add a comment| up vote 3 down vote I had this problem too, I resolved this in a different way, as far as I know Save your draft before refreshing this page.Submit any pending changes before refreshing this page. https://github.com/kelektiv/node.bcrypt.js/issues/25 Drew LeSueur said on September 5, 2010 at 8:32 am: Thanks, I would also reccomend selecting to install git as well as cURL Pingback: Getting Started with Node.js on Windows -

Try re-installing G++ package again or installing C++ package. Everything's working now thanks. Collaborator ncb000gt commented Aug 5, 2011 In his comment he noted that he had installed XCode 4.1. Thanks !

Sign in to comment Contact GitHub API Training Shop Blog About © 2016 GitHub, Inc. http://www.itkeyword.com/doc/9821656717675745628/how-to-compile-install-node-jscould-not-configure-a-cxx-compiler-ubuntu https://launchpad.net/~chris-lea/+archive/node.js/ share|improve this answer answered Feb 21 '13 at 22:10 nolazybits 302115 add a comment| Your Answer draft saved draft discarded Sign up or log in Sign up using Google Thanks! Useful links: http://codebetter.com/matthewpodwysocki/2010/09/08/getting-started-with-node-js-on-windows/ http://boxysystems.com/index.php/step-by-step-instructions-to-install-nodejs-on-windows/comment-page-1/ - maybe, there's not all things to be downloaded in the list http://code.google.com/p/cyg-apt/issues/detail?id=8 http://www.cygwin.com/ml/cygwin/2003-06/msg01241.html http://blog.brev.name/2010/09/nodejs-on-windows-7-under-cygwin.html?showComment=1284936993253_AIe9_BEuSc8B_nu9KzMfcAkQW3YQuXtbqZj7M33avU74Waa1oMLbyOQ3wTDHHkCiW4wJ7eIAyeTqubS7EE3I9wswhzY2QBj4Pc0XhvL6e77Ag6u47oNY8EQrhpEkvij4W1r7JKmt3VchNR0KpWzD796Z3U0jqBP1mClwww_V7F2tiie5Jd5xOLr0gLw6Ur5UpnRRu3Knvksb3itiR3WlF_cwsZEDmcR9GQ_etqSRvE_bKXqIwGUOngx_vVsP-RkpN-BNeIZkU3JhXOYbW_ACU4_6QiQ1Ox1jeyfCJdq6tQsP2vOfmcc27HkzPHU5rtNknX63_hUpqoi_TqVxEIQncYn5JGKzvO3pm0bLYRhtZBm1MxlpHrW82dTSwkiipR1Moy2tFBiYYXDUUBluGd-DWyWIUcMLyE1UWHmDKGirZq_oO5F0MT8eMbOaLrQWGjs5TNFKH9yMkoebCvgKTE6d0gCbV4gcO5uUukSlBS5DjsPWtBPrTmUd94Kj9wq7i0meknClWONnjWPlYKklRSFefjUBmafUy8URlkkSp0v6Fmt2zhu23Nt6Q35ZkblcxqLgmdmUq_YWgRnMdvc58HGR-e__63hxyX7GIH4j09PM0uaCJx0OeGFHET4cvP_u1eK6dwspuhNiqzN6Abltz2gNpeLrUaL30vKfhtqrb2Z1Quxrh9hedx6zQuU#c1502407389787754114 Change 83th and 110th lines of rebaseall text file.

Saved me tons of time. –Mike Grace Aug 18 '11 at 16:12 much appreciated! –Eric Oct 15 '11 at 21:00 I <3 U. Check This Out Setting up a Windows system environment named ‘CYGWIN' with the value ‘nodosfilewarning' gets rid of the warning above. And my advice to use option "-v" in case of error to see what is going on. Build failed: -> task failed (err #-1): {task: cc eio.c -> eio_1.o} Below is a complete stack trace… $ make Waf: Entering directory `/cygdrive/c/cygwin-home/node-v0.4.12/build' DEST_OS: cygwin DEST_CPU: ia32 Parallel Jobs: 1

Bcrypt was working fine before the upgrade, but when trying to install the module post upgrade I keep getting the following error: /Users/vik/local_repo/myapp/node_modules/bcrypt/wscript:16: error: could not configure a cxx compiler! lets.lincredible 2016-07-10 18:22:37 UTC #11 Hi, Helge, Thanks for the help. The system returned: (111) Connection refused The remote host or network may be down. http://awendigital.com/could-not/could-not-configure-a-cxx-compiler-ubuntu.html This is the link : pastebin.com http://pastebin.com/t5YKmqs7 Pohsuans-MacBook-Pro:scripts pohsuanhuang$ CXX='usr/bin/c++' make -j3 [ 0%] Performing configure step for 'Apr1StaticLib' [ 3%] Built target Swig [ 3%] Performing configure step for 'CapnProto'

Your cache administrator is webmaster. Pre-requisites: Cygwin with Python & some additional packages (we'll go over that in a bit) Double click Cygwin's setup.exe and continue till you get to select packages window Select Python Select And instead of just running ./configure I ran this command ./configure -dest-cpu=ia32 per the suggestion from my instructor (I'm taking an online class on node.js) and then ran the ‘make' and

show original helge 2016-07-10 20:06:13 UTC #12 Your output shows the following error: Traceback (most recent call last): File "", line 1, in ImportError: No module named capnp You could

share|improve this answer answered May 29 '11 at 12:05 Jayson J. I have updated this article for v0.4.7. Innovation through creativity… Main menu Skip to primary content Skip to secondary content Portfolio DZone Reader app(Android/iOS) Script Monkey JGoogleAnalytics Newsreader app(Android/iOS) TheRandomHomepage Topics Java open-source JavaScript Chrome HTML5 Tips GSoC It might be something to do with your network connection.

I believe it's necessary to update the post to address issue with more modern Window systems. A published paper stole my unpublished results from a science fair How should night time be determined and logged in a fast westbound plane? You signed in with another tab or window. have a peek here Why did it take longer to go to Rivendell in The Hobbit than in The Fellowship of the Ring?